[Date Prev][Date Next] [Chronological] [Thread] [Top]

Re: LDAP test003-search fails on my itanium box

I installed openldap-2.2.28 and it seems  to have fixed the problem with the itanium server.
I have other boxes running openldap-2.2.26 and used as slaves. Is it ok if i use 2.2.28 with 2.2.26?

Quanah Gibson-Mount <quanah@stanford.edu> wrote:

--On Monday, August 29, 2005 12:08 PM -0700 Moe wrote:

> Thats is what im getting. Is there a log directory for the tests?.
> ./scripts/test003-search: line 70: 8434 Segmentation fault $SLAPD
> -f $CONF1 -h $URI1 -d $LVL $TIMING >$LOG1 2>&1
> ldapsearch failed (255)!
> ./scripts/test003-search: line 74: kill: (8434) - No such process
>>>>>> ./scripts/test003-search failed (exit 255)
> make[2]: *** [bdb-yes] Error 255
> make[2]: Leaving directory `/apps/openldap-2.2.26/tests'
> make[1]: *** [test] Error 2
> make[1]: Leaving directory `/apps/openldap-2.2.26/tests'
> make: *** [test] Error 2

First, please read:

and learn to address your replies appropriately.


Yes, it is /apps/openldap-2.2.26/tests/testrun


Quanah Gibson-Mount
Principal Software Developer
ITSS/Shared Services
Stanford University
GnuPG Public Key: http://www.stanford.edu/~quanah/pgp.html

"These censorship operations against schools and libraries are stronger
than ever in the present religio-political climate. They often focus on
fantasy and sf books, which foster that deadly enemy to bigotry and blind
faith, the imagination." -- Ursula K. Le Guin

 Start your day with Yahoo! - make it your home page