[Date Prev][Date Next] [Chronological] [Thread] [Top]

Installation of OpenLDAP

Hello everybody,

I have a problem during the installation of OpenLDAP...
When I run the "make", it fails with this error :

> ld: Undefined symbols:
> _res_9_dn_expand
> _res_9_query
> make[2]: *** [dntest] Error 1
> make[1]: *** [all-common] Error 1
> make: *** [all-common] Error 1

I don't understand what's wrong...
Could anybody help me ? I have a text file which has the whole result of the
command make.