[Date Prev][Date Next] [Chronological] [Thread] [Top]

Re: RE24 testing call (2.4.41)

Frank Offermanns wrote:
Build fails for 32 bit  msys/mingw (and config --prefix=/mingw
--enable-accesslog --with-tls --enable-syncprov)

slapadd.o: In function `getrec0':
C:/msys/1.0/openldap-2.4.41Git/servers/slapd/slapadd.c:116: undefined
to `ftello'
slapadd.o: In function `slapadd':
C:/msys/1.0/openldap-2.4.41Git/servers/slapd/slapadd.c:486: undefined
to `ftello'
libbackends.a(mdbmdb.o): In function `mdb_cursor_push':

db/mdb.c:5001: undefined reference to `GetFileSizeEx'
collect2: ld returned 1 exit status
make[2]: *** [slapd.exp] Error 1
make[2]: Leaving directory `/openldap-2.4.41Git/servers/slapd'
make[1]: *** [all-common] Error 1
make[1]: Leaving directory `/openldap-2.4.41Git/servers'
make: *** [all-common] Error 1

You already encountered this a few months ago.


Submit an ITS if you want a fix committed, otherwise fix your build as was already suggested on the original email thread.

  -- Howard Chu
  CTO, Symas Corp.           http://www.symas.com
  Director, Highland Sun     http://highlandsun.com/hyc/
  Chief Architect, OpenLDAP  http://www.openldap.org/project/