[Date Prev][Date Next] [Chronological] [Thread] [Top]

failing to "make test" in openldap installation

Hullo everyone

I am installing Openldap but in am failing to test and below are my installation commands:

env CPPFLAGS="-I/usr/local/BerkeleyDB.5.1/include -I/usr/local/ssl/include/openssl" \
LDFLAGS="-L/usr/local/BerkeleyDB.5.1/lib -L/usr/local/ssl/lib" \

./configure --sysconfdir=/etc --with-cyrus-sasl --with-threads --with-tls --with-yielding-select --with-mp --enable-slapd  --enable-slurpd --enable-cleartext --enable-bdb --enable-ldap --enable-monitor --enable-perl --enable-sql --enable-syslog  --enable-spasswd

make test has the following errors at the end

Initiating LDAP tests for BDB...
Could not locate slapd(8)
make[2]: *** [bdb-yes] Error 1
make[2]: Leaving directory `/usr/local/src/openldap-2.4.23/tests'
make[1]: *** [test] Error 2
make[1]: Leaving directory `/usr/local/src/openldap-2.4.23/tests'
make: *** [test] Error 2


Anybody to help me go over this?