[Date Prev][Date Next] [Chronological] [Thread] [Top]

make test error

I am getting the following error when I run "make test" with 

>>>>> Starting test002-populate ...
running defines.sh
Starting slapd on TCP/IP port 9011...
Using ldapsearch to check that slapd is running...
Waiting 5 seconds for slapd to start...
Using ldapadd to populate the database...
ldapadd failed (1)!
>>>>> ./scripts/test002-populate failed (exit 1)
make[2]: *** [bdb-yes] Error 1
make[2]: Leaving directory 
make[1]: *** [test] Error 2
make[1]: Leaving directory 
make: *** [test] Error 2

All previous tests complete OK.

The system is Slackware 9.1 with 2.4.26 kernel, I compiled openldap with 
these options:

./configure --enable-spasswd --disable-cleartext --enable-wrappers 
make depend
make test

I also installed the following dependencies (prior to openldap):

db-4.2.52.NC - applied patches patch. & patch.

Any help, or insight, would be appreciated.

Mike Hall
Systems Administrator
Zoot Enterprises Inc.  www.zootweb.com
 Copyright (c) 2004 Zoot Enterprises, Inc. All rights reserved. 
 This email, including any attachments, is confidential and may 
 not be redistributed without permission. If you are not an intended
 recipient, you have received this message in error; please notify us
 immediately by replying to this message and deleting it from your
 computer. Thank you.