[Date Prev][Date Next] [Chronological] [Thread] [Top]

[no subject]

I have slackware 8 kernel 2.2.19 and
I am trying to compile openldap and I get this error message when I do the
"make install" :

make[1]: Entering directory `/home/garb/openldap/openldap-2.0.19/tests'
ln: `./data': cannot overwrite directory
make[1]: [test-ldbm] Error 1 (ignored)
ln: `./schema': File exists
make[1]: [test-ldbm] Error 1 (ignored)
Initiating LDAP tests for LDBM...
>>>>> Executing all LDAP tests...
>>>>> Test Directory: .
>>>>> Backend: ldbm
>>>>> Starting test000-rootdse ...
running defines.sh . ldbm
Datadir is ./data
Cleaning up in ./test-db...
Starting slapd on TCP/IP port 9009...
Using ldapsearch to retrieve all the entries...
./scripts/test000-rootdse: kill: (19901) - No such pid
../clients/tools/ldapsearch: error while loading shared libraries: cannot
open shared object file: cannot load shared object file: No such file or
>>>>> Test failed
>>>>> ./scripts/test000-rootdse failed (exit 127)
make[1]: *** [test-ldbm] Error 127
make[1]: Leaving directory `/home/garb/openldap/openldap-2.0.19/tests'
make: *** [test] Error 2

Any ideas would be helpful.  Thanks
Rudy Garbalosa