[Date Prev][Date Next] [Chronological] [Thread] [Top]

Re: RE24 testing

On Jul 12, 2008, at 07:55 , Quanah Gibson-Mount wrote:

Please test RE24, thanks!

Hm... Seeing a problem during "make" on OS X 10.5.4/Intel. This is a test sandbox I've been using for months to run these tests, I always just "cvs up", then "make clean; make depend; make". Anyone have an idea what's happening?

Making all in /usr/local/src/openldap-2.4-branch/clients
Entering subdirectory tools
../../build/mkversion -v "2.4.X" -s ldapsearch > ldsversion.c
cc -I/usr/local/BerkeleyDB.4.6/include -I../../include -I../../ include -I/usr/local/BerkeleyDB.4.6/include -c -o ldapsearch.o ldapsearch.c
cc -I/usr/local/BerkeleyDB.4.6/include -I../../include -I../../ include -I/usr/local/BerkeleyDB.4.6/include -c -o common.o common.c
cc -I/usr/local/BerkeleyDB.4.6/include -I../../include -I../../ include -I/usr/local/BerkeleyDB.4.6/include -c -o ldsversion.o ldsversion.c
/bin/sh ../..//libtool --mode=link cc -static -I/usr/local/BerkeleyDB. 4.6/include -L/usr/local/BerkeleyDB.4.6/lib -o ldapsearch ldapsearch.o common.o ldsversion.o ../../libraries/liblutil/ liblutil.a ../../libraries/libldap/libldap.la ../../libraries/liblber/ liblber.la -lsasl2 -lssl -lcrypto -lresolv
cc -I/usr/local/BerkeleyDB.4.6/include -o ldapsearch ldapsearch.o common.o ldsversion.o -L/usr/local/BerkeleyDB.4.6/lib ../../libraries/ liblutil/liblutil.a ../../libraries/libldap/.libs/libldap.a /usr/local/ src/openldap-2.4-branch/libraries/liblber/.libs/liblber.a ../../ libraries/liblber/.libs/liblber.a -lsasl2 -lssl -lcrypto -lresolv
Undefined symbols:
"_ldap_create_assertion_control_value", referenced from:
_tool_server_controls in common.o
ld: symbol(s) not found
collect2: ld returned 1 exit status
make[2]: *** [ldapsearch] Error 1
make[1]: *** [all-common] Error 1
make: *** [all-common] Error 1