[Date Prev][Date Next] [Chronological] [Thread] [Top]

Re: (ITS#7069) test061-syncreplication-initiation failed for hdb

michael@stroeder.com wrote:
> Full_Name: Michael Ströder
> Version: HEAD (from git)
> OS: openSUSE 11.4
> URL: ftp://ftp.openldap.org/incoming/
> Submission from: (NULL) (
>>>>>> test061-syncreplication-initiation failed for hdb
> (exit 255)
> make[2]: *** [hdb-mod] Error 255
> make[2]: Leaving directory `/usr/src/michael/openldap/tests'
> make[1]: *** [test] Error 2
> make[1]: Leaving directory `/usr/src/michael/openldap/tests'
> make: *** [test] Error 2

Not enough info in your testrun directory, what was the output from the script 
up this point?

 From reading the slapd.?.log files, it also looks like something in your 
environment is slowing down the SASL init here, enough to make the script timeout.

On all of my tests here the timestamp for slap_sasl_init is always identical 
to the preceding timestamp, i.e., slap_sasl_init should never even take as 
long as 1 second. Fix your environment before submitting any more bug reports.

   -- Howard Chu
   CTO, Symas Corp.           http://www.symas.com
   Director, Highland Sun     http://highlandsun.com/hyc/
   Chief Architect, OpenLDAP  http://www.openldap.org/project/