[Date Prev][Date Next] [Chronological] [Thread] [Top]

Re: OpenLDAP installation on Solaris (ITS#1623)

hi Kurt,

Thought the problem was not in configure, I followed your suggestion and added /usr/ccs/bin in path. The problem of command not found is solved and make proceeds further.

But it halts again with following errors:

Entering subdirectory liblber
make[2]: Entering directory `/usr/local/openldap/openldap-2.0.23/libraries/liblb
/bin/sh /usr/local/openldap/openldap-2.0.23/libtool   --mode=compile gcc -g -O2
-I../../include        -I../../include   -I/usr/local/BerkeleyDB.3.2/include
-c assert.c
mkdir .libs
gcc -g -O2 -I../../include -I../../include -I/usr/local/BerkeleyDB.3.2/include -
c assert.c  -fPIC -DPIC -o .libs/assert.lo
gcc -g -O2 -I../../include -I../../include -I/usr/local/BerkeleyDB.3.2/include -
c assert.c -o assert.o >/dev/null 2>&1
mv -f .libs/assert.lo assert.lo
/bin/sh /usr/local/openldap/openldap-2.0.23/libtool   --mode=compile gcc -g -O2
-I../../include        -I../../include   -I/usr/local/BerkeleyDB.3.2/include
-c decode.c
rm -f .libs/decode.lo
gcc -g -O2 -I../../include -I../../include -I/usr/local/BerkeleyDB.3.2/include -
c decode.c  -fPIC -DPIC -o .libs/decode.lo
/usr/ccs/bin/as: "/var/tmp/ccqz659o.s", line 2974: error: unknown opcode ".subse
/usr/ccs/bin/as: "/var/tmp/ccqz659o.s", line 2974: error: statement syntax
/usr/ccs/bin/as: "/var/tmp/ccqz659o.s", line 3070: error: unknown opcode ".previ
/usr/ccs/bin/as: "/var/tmp/ccqz659o.s", line 3070: error: statement syntax
/usr/ccs/bin/as: "/var/tmp/ccqz659o.s", line 3071: error: unknown opcode ".subse
/usr/ccs/bin/as: "/var/tmp/ccqz659o.s", line 3071: error: statement syntax
/usr/ccs/bin/as: "/var/tmp/ccqz659o.s", line 3167: error: unknown opcode ".previ
/usr/ccs/bin/as: "/var/tmp/ccqz659o.s", line 3167: error: statement syntax
make[2]: *** [decode.lo] Error 1
make[2]: Leaving directory `/usr/local/openldap/openldap-2.0.23/libraries/liblbe
make[1]: *** [all-common] Error 1

I am hoping to see some more suggestions from you.

Thanks in advance..


>From: "Kurt D. Zeilenga" <Kurt@OpenLDAP.org>
>To: deepak_shah@hotmail.com
>CC: openldap-its@OpenLDAP.org
>Subject: Re: OpenLDAP installation on Solaris  (ITS#1623)
>Date: Tue, 05 Mar 2002 12:20:09 -0800
>I would guess that configure failed to locate ar(1).
>You likely need to adjust your path or install GNU ar(1).
>At 08:38 PM 2002-03-04, deepak_shah@hotmail.com wrote:
>>Full_Name: Deepak Shah
>>Version: 2.0.23
>>OS: Solaris 5.7
>>URL: ftp://ftp.openldap.org/incoming/
>>Submission from: (NULL) (
>>Hi Everyone,
>>we are trying to install openldap on solaris.
>>Upto "make depend" everything works fine, but we are getting following errors in
>>Can anyone put some more light on this:
>># make
>>Making all in /usr/local/openldap/openldap-2.0.23
>>  Entering subdirectory include
>>make[1]: Entering directory `/usr/local/openldap/openldap-2.0.23/include'
>>make[1]: Nothing to be done for `all'.
>>make[1]: Leaving directory `/usr/local/openldap/openldap-2.0.23/include'
>>  Entering subdirectory libraries
>>make[1]: Entering directory `/usr/local/openldap/openldap-2.0.23/libraries'
>>Making all in /usr/local/openldap/openldap-2.0.23/libraries
>>  Entering subdirectory liblutil
>>make[2]: Entering directory
>>ru liblutil.a base64.o debug.o entropy.o sasl.o signal.o md5.o passwd.o sha1.o
>>etpass.o lockf.o utils.o sockpair.o setproctitle.o detach.o version.o
>>make[2]: ru: Command not found
>>make[2]: *** [liblutil.a] Error 127
>>make[2]: Leaving directory
>>make[1]: *** [all-common] Error 1
>>make[1]: Leaving directory `/usr/local/openldap/openldap-2.0.23/libraries'
>>make: *** [all-common] Error 1
>>Thanks in Advance !

Send and receive Hotmail on your mobile device: http://mobile.msn.com